{"text_format":"1","workbook":"xlsx","n_sheets":5,"sheets":["波形","Read_Me","Data","計算","Module1"],"not_rendered":{"charts":1,"images":1,"macros":1,"external_links":0,"defined_names":0,"comments":0,"pivot_tables":0},"unopened":[{"sheet":"Module1","index":4,"reason":"part_missing"}],"bounds":{"document_bytes":16777216,"sheet_cells":100000,"rows_first":2000,"rows_last":500,"rows_between":2000,"halvings":0,"cell_chars":16384,"cell_head_chars":4096},"cells_cut":0,"cells_raw":0,"read":"whole","date_system":"1900"}

{"sheet":"波形","index":0,"n_rows":12,"n_cols":24,"rows_kept":12,"cut":false,"hidden":false,"merged":[[11,5,11,7],[11,15,11,16],[7,4,7,5],[11,12,11,13],[6,23,6,24],[2,21,2,23],[5,14,5,15],[4,3,4,4],[6,4,6,5]]}
[]
[]
[null,null,null,null,null,null,null,null,null,null,null,null,null,null,null,null,null,null,null,null,null," GND"]
[null,null,null,null,null,"  "]
[null,null,null," 3.3 V"]
[null,null,null,null,null,null,null,null,null,null,null,null,null,null,"表示しない"]
[null,null,null,null," 12 mA",null,null,null,null,null,null,null,null,null,null,null,null,null,null,null,null,null,null," 無し"]
[null,null,null,null," .5 ns"]
[]
[]
[]
[null,null,null,null,null," 無し",null,null,null,null,null,null," 50Ω",null,null," 15 cm"]

{"sheet":"Read_Me","index":1,"n_rows":45,"n_cols":5,"rows_kept":45,"cut":false,"hidden":false,"merged":[]}
[]
[null,"プリント配線板などの分布定数線路の信号の解析ツールです."]
[]
[null,"1. 何ができるか"]
[null,"プリント配線板の特性インピーダンスや回路定数を選択することにより, 近端, 途中, 遠端 の波形を解析して表示します.⇒｢波形｣のシートをクリック下さい."]
[]
[null,"2. 使い方"]
[null,"解説が不要なくらい簡単です."]
[null,"図の中のプルダウンメニューから,定数を選択下さい."]
[null,"各パラメータは,"]
[null,"電源電圧 ",null,"1.0V,1.8V, 2.5V, 3.3V, 5V を準備しています. このほかに,%表示も選択できます."]
[null,"駆動能力 ",null,"ドライバのカタログ記載の駆動能力です. ここでは, 実力がカタログ記載値の1.5倍あると仮定して, 出力が0.4Vのときの抵抗値に換算しています."]
[null,null,null,"(例 : 4mA=66.7Ω, 24mA=11.1Ω)"]
[null,"立ち上がり時間",null,"ドライバの立ち上がり(または下がり)時間を 0.1ns から 2ns から選択します."]
[null,"ダンピング抵抗",null,"ドライバの出力に直列に挿入するダンピング抵抗です."]
{"$rows_left_out":31}
{"sheet":"Data","index":2,"n_rows":18,"n_cols":27,"rows_kept":18,"cut":false,"hidden":false,"merged":[[0,19,0,20],[0,22,0,23],[0,25,0,26],[0,0,0,2],[0,4,0,5],[0,7,0,8],[0,10,0,11],[0,13,0,14],[0,16,0,17]]}
["IoL",null,null,null,"Dumping R",null,null,"Zo",null,null,"tr/tf",null,null,"線長",null,null,"Vcc",null,null,"終端抵抗",null,null,"終端電圧",null,null,"中間点"]
[{"$f":"TEXT(B2,\" ##\")&\" mA\"","v":" 2 mA"},2,{"$f":"400/B2/1.5","v":133.33333333333334},null," 無し",0,null,{"$f":"TEXT(I2,\" ##\")&\"Ω\"","v":" 30Ω"},30,null,{"$f":"TEXT(L2,\" ##.0\")&\" ns\"","v":" .1 ns"},0.1,null,{"$f":"TEXT(O2,\" ##\")&\" cm\"","v":" 5 cm"},5,null,{"$f":"TEXT(R2,\" ##\")&\" V\"","v":" 1 V"},1,null," 無し",1000000,null," GND",0,null,"表示しない",1]
[" 4 mA",4,66.666666666666671,null,{"$f":"TEXT(F3,\" ##\")&\"Ω\"","v":" 10Ω"},10,null," 40Ω",40,null," .2 ns",0.2,null," 10 cm",10,null,{"$f":"TEXT(R3,\" ##.#\")&\" V\"","v":" 1.8 V"},1.8,null,{"$f":"\"整合(\"&TEXT(U3,\"###\")&\"Ω)\"","v":"整合(50Ω)"},{"$f":"計算!B3","v":50},null," 1.5 V",1.5,null,"近端から1/4",0.25]
[" 6 mA",6,44.44444444444445,null," 15Ω",15,null," 50Ω",50,null," .5 ns",0.5,null," 15 cm",15,null,{"$f":"TEXT(R4,\" ##.#\")&\" V\"","v":" 2.5 V"},2.5,null,{"$f":"TEXT(U4,\" ##\")&\"Ω\"","v":" 20Ω"},20,null,{"$f":"\"Vcc/2 (\"&X4&\"V)\"","v":"Vcc/2 (1.65V)"},{"$f":"計算!B12/2","v":1.65},null,"中間点",0.5]
[" 8 mA",8,33.333333333333336,null," 22Ω",22,null," 55Ω",55,null," 1.0 ns",1,null," 20 cm",20,null,{"$f":"TEXT(R5,\" ##.#\")&\" V\"","v":" 3.3 V"},3.3,null," 30Ω",30,null,{"$f":"\"Vcc (\"&X5&\"V)\"","v":"Vcc (3.3V)"},{"$f":"計算!B12","v":3.3},null,"遠端から1/4",0.75]
[" 12 mA",12,22.222222222222225,null," 33Ω",33,null," 60Ω",60,null," 1.5 ns",1.5,null," 25 cm",25,null,{"$f":"TEXT(R6,\" ##\")&\" V\"","v":" 5 V"},5,null," 40Ω",40]
[" 16 mA",16,16.666666666666668,null," 36Ω",36,null," 65Ω",65,null," 2.0 ns",2,null," 30 cm",30,null,"%",100,null," 50Ω",50]
[" 24 mA",24,11.111111111111112,null," 39Ω",39,null," 70Ω",70,null," .0 ns",null,null,"  cm",null,null,null,null,null," 60Ω",60]
[" 48 mA",48,5.5555555555555562,null," 43Ω",43,null," 80Ω",80,null,null,null,null,"  cm",null,null,null,null,null," 70Ω",70]
[null,null,null,null," 47Ω",47,null," 90Ω",90,null,null,null,null,null,null,null,null,null,null," 80Ω",80]
[null,null,null,null," 51Ω",51,null," 100Ω",100,null,null,null,null,null,null,null,null,null,null," 90Ω",90]
[null,null,null,null," 56Ω",56,null," Ω",null,null,null,null,null,null,null,null,null,null,null," 100Ω",100]
[null,null,null,null," 62Ω",62,null," Ω",null,null,null,null,null,null,null,null,null,null,null," 150Ω",150]
[null,null,null,null,{"$f":"IF(計算!B3-計算!C1>0,\"送端終端(\"&TEXT(F14,\"###\")&\"Ω)\",\"送端終端解なし\")","v":"送端終端(28Ω)"},{"$f":"IF(計算!B3-計算!C1>0,計算!B3-計算!C1,0)","v":27.777777777777775},null,null,null,null,null,null,null,null,null,null,null,null,null," 200Ω",200]
[null,null,null,null,{"$f":"IF(計算!B3/3-計算!C1>0,\"双方向(\"&TEXT(F15,\"###\")&\"Ω)\",\"双方向解なし\")","v":"双方向解なし"},{"$f":"IF(計算!B3/3-計算!C1>0,計算!B3/3-計算!C1,0)","v":0},null,null,null,null,null,null,null,null,null,null,null,null,null," 300Ω",300]
{"$rows_left_out":4}
{"sheet":"計算","index":3,"n_rows":50,"n_cols":105,"rows_kept":50,"cut":false,"hidden":true,"merged":[]}
["R1(Ω)",{"$f":"C1+VLOOKUP(波形!F12,Data!E2:F18,2,0)+0.000000001","v":22.222222223222225},{"$f":"VLOOKUP(波形!E7,Data!A2:C9,3,0)","v":22.222222222222225},null,"近端",0,null,null,null,null,0,{"$f":"K1+2","v":2},4,6,8,10,12,14,16,18,20,22,null,null,1,{"$f":"Y1+2","v":3},5,7,9,11,13,15,17,19,21,null,null,null,"遠端",{"$f":"B4","v":0.97499999999999998},null,null,null,null,0,{"$f":"AS1+2","v":2},4,6,8,10,12,14,16,18,20,22,null,null,1,{"$f":"BG1+2","v":3},5,7,9,11,13,15,17,19,21,null,null,null,"中間",{"$f":"B13*B4","v":0.97499999999999998},null,null,null,null,0,{"$f":"CA1+2","v":2},4,6,8,10,12,14,16,18,20,22,null,null,1,{"$f":"CO1+2","v":3},5,7,9,11,13,15,17,19,21]
["R2(Ω)",{"$f":"C2+0.000000001","v":1000000.000000001},{"$f":"VLOOKUP(波形!X7,Data!T2:U17,2,0)","v":1000000},null,null,null,null,null,null,null,{"$f":"F4","v":0},{"$f":"F5","v":1.95},{"$f":"F6","v":3.9},{"$f":"F7","v":5.85},{"$f":"F8","v":7.8},{"$f":"F9","v":9.75},{"$f":"F10","v":11.7},{"$f":"F11","v":13.649999999999999},{"$f":"F12","v":15.599999999999998},{"$f":"F13","v":17.549999999999997},{"$f":"F14","v":19.499999999999996},{"$f":"F15","v":21.449999999999996},null,null,{"$f":"F29","v":1.95},{"$f":"F30","v":3.9},{"$f":"F31","v":5.85},{"$f":"F32","v":7.8},{"$f":"F33","v":9.75},{"$f":"F34","v":11.7},{"$f":"F35","v":13.649999999999999},{"$f":"F36","v":15.599999999999998},{"$f":"F37","v":17.549999999999997},{"$f":"F38","v":19.499999999999996},{"$f":"F39","v":21.449999999999996},null,null,null,null,null,null,null,null,null,{"$f":"AN4","v":0.97499999999999998},{"$f":"AN5","v":2.9249999999999998},{"$f":"AN6","v":4.875},{"$f":"AN7","v":6.8250000000000002},{"$f":"AN8","v":8.7750000000000004},{"$f":"AN9","v":10.725},{"$f":"AN10","v":12.674999999999999},{"$f":"AN11","v":14.624999999999998},{"$f":"AN12","v":16.574999999999999},{"$f":"AN13","v":18.524999999999999},{"$f":"AN14","v":20.474999999999998},{"$f":"AN15","v":22.424999999999997},null,null,{"$f":"AN29","v":0.97499999999999998},{"$f":"AN30","v":2.9249999999999998},{"$f":"AN31","v":4.875},{"$f":"AN32","v":6.8250000000000002},{"$f":"AN33","v":8.7750000000000004},{"$f":"AN34","v":10.725},{"$f":"AN35","v":12.674999999999999},{"$f":"AN36","v":14.624999999999998},{"$f":"AN37","v":16.574999999999999},{"$f":"AN38","v":18.524999999999999},{"$f":"AN39","v":20.474999999999998},null,null,null,null,null,null,null,null,null,{"$f":"BV4","v":0.97499999999999998},{"$f":"BV5","v":2.9249999999999998},{"$f":"BV6","v":4.875},{"$f":"BV7","v":6.8250000000000002},{"$f":"BV8","v":8.7750000000000004},{"$f":"BV9","v":10.725},{"$f":"BV10","v":12.674999999999999},{"$f":"BV11","v":14.624999999999998},{"$f":"BV12","v":16.574999999999999},{"$f":"BV13","v":18.524999999999999},{"$f":"BV14","v":20.474999999999998},{"$f":"BV15","v":22.424999999999997},null,null,{"$f":"BV29","v":0.97499999999999998},{"$f":"BV30","v":2.9249999999999998},{"$f":"BV31","v":4.875},{"$f":"BV32","v":6.8250000000000002},{"$f":"BV33","v":8.7750000000000004},{"$f":"BV34","v":10.725},{"$f":"BV35","v":12.674999999999999},{"$f":"BV36","v":14.624999999999998},{"$f":"BV37","v":16.574999999999999},{"$f":"BV38","v":18.524999999999999},{"$f":"BV39","v":20.474999999999998}]
["Z0(Ω)",{"$f":"VLOOKUP(波形!M12,Data!H2:I13,2,0)","v":50},null,null,null,{"$f":"-$C$4+F$1","v":-1.95},null,null,null,null,{"$f":"G4","v":2.2846153845837516},{"$f":"G5","v":-0.87861035936689647},{"$f":"G6","v":0.33789327026153881},{"$f":"G7","v":-0.12994595484886676},{"$f":"G8","v":4.99742157294625E-2},{"$f":"G9","v":-1.9218930213560526E-2},{"$f":"G10","v":7.3911570829504319E-3},{"$f":"G11","v":-2.8424684630106501E-3},{"$f":"G12","v":1.0931477808593494E-3},{"$f":"G13","v":-4.2039941211240205E-4},{"$f":"G14","v":1.6167591317389597E-4},{"$f":"G15","v":-6.2176825531869083E-5},null,null,{"$f":"G29","v":2.2843869344677987},{"$f":"G30","v":-0.87852250272379184},{"$f":"G31","v":0.33785948262389454},{"$f":"G32","v":-0.12993296090307915},{"$f":"G33","v":4.9969218557748135E-2},{"$f":"G34","v":-1.9217008416629017E-2},{"$f":"G35","v":7.3904180041960742E-3},{"$f":"G36","v":-2.8421842303759806E-3},{"$f":"G37","v":1.0930384715467291E-3},{"$f":"G38","v":-4.2035737427308274E-4},{"$f":"G39","v":1.6165974639091772E-4},null,null,null,null,{"$f":"-$C$4+AN$1","v":-0.97499999999999998},null,null,{"$f":"0","v":0},null,{"$f":"AO4","v":2.2846153845837516},{"$f":"AO5","v":-0.87861035936689647},{"$f":"AO6","v":0.33789327026153881},{"$f":"AO7","v":-0.12994595484886676},{"$f":"AO8","v":4.99742157294625E-2},{"$f":"AO9","v":-1.9218930213560526E-2},{"$f":"AO10","v":7.3911570829504319E-3},{"$f":"AO11","v":-2.8424684630106501E-3},{"$f":"AO12","v":1.0931477808593494E-3},{"$f":"AO13","v":-4.2039941211240205E-4},{"$f":"AO14","v":1.6167591317389597E-4},{"$f":"AO15","v":-6.2176825531869083E-5},null,null,{"$f":"AO29","v":2.2843869344677987},{"$f":"AO30","v":-0.87852250272379184},{"$f":"AO31","v":0.33785948262389454},{"$f":"AO32","v":-0.12993296090307915},{"$f":"AO33","v":4.9969218557748135E-2},{"$f":"AO34","v":-1.9217008416629017E-2},{"$f":"AO35","v":7.3904180041960742E-3},{"$f":"AO36","v":-2.8421842303759806E-3},{"$f":"AO37","v":1.0930384715467291E-3},{"$f":"AO38","v":-4.2035737427308274E-4},{"$f":"AO39","v":1.6165974639091772E-4},null,null,null,null,{"$f":"-$C$4+BV$1","v":-0.97499999999999998},null,null,{"$f":"0","v":0},null,{"$f":"BW4","v":2.2846153845837516},{"$f":"BW5","v":-0.87861035936689647},{"$f":"BW6","v":0.33789327026153881},{"$f":"BW7","v":-0.12994595484886676},{"$f":"BW8","v":4.99742157294625E-2},{"$f":"BW9","v":-1.9218930213560526E-2},{"$f":"BW10","v":7.3911570829504319E-3},{"$f":"BW11","v":-2.8424684630106501E-3},{"$f":"BW12","v":1.0931477808593494E-3},{"$f":"BW13","v":-4.2039941211240205E-4},{"$f":"BW14","v":1.6167591317389597E-4},{"$f":"BW15","v":-6.2176825531869083E-5},null,null,{"$f":"BW29","v":2.2843869344677987},{"$f":"BW30","v":-0.87852250272379184},{"$f":"BW31","v":0.33785948262389454},{"$f":"BW32","v":-0.12993296090307915},{"$f":"BW33","v":4.9969218557748135E-2},{"$f":"BW34","v":-1.9217008416629017E-2},{"$f":"BW35","v":7.3904180041960742E-3},{"$f":"BW36","v":-2.8421842303759806E-3},{"$f":"BW37","v":1.0930384715467291E-3},{"$f":"BW38","v":-4.2035737427308274E-4},{"$f":"BW39","v":1.6165974639091772E-4}]
["τ(ns )",{"$f":"$B$5*$B$6","v":0.97499999999999998},{"$f":"B4*2","v":1.95},null,"vR",{"$f":"F3+$C$4","v":0},{"$f":"$B$3/($B$1+$B$3)*$B$12","v":2.2846153845837516},null,{"$f":"0","v":0},{"$f":"-B4","v":-0.97499999999999998},null,null,null,null,null,null,null,null,null,null,null,null,null,null,null,null,null,null,null,null,null,null,null,null,null,null,{"$f":"AK5","v":0.01},null,"vR",{"$f":"AN3+$C$4","v":0.97499999999999998},{"$f":"$B$3/($B$1+$B$3)*$B$12","v":2.2846153845837516},null,null,{"$f":"J4","v":-0.97499999999999998},null,null,null,null,null,null,null,null,null,null,null,null,null,null,null,null,null,null,null,null,null,null,null,null,null,null,{"$f":"BS5","v":0.01},null,"vR",{"$f":"BV3+$C$4","v":0.97499999999999998},{"$f":"$B$3/($B$1+$B$3)*$B$12","v":2.2846153845837516},null,null,{"$f":"J4","v":-0.97499999999999998},null,null,null,null,null,null,null,null,null,null,null,null,null,null,null,null,null,null,null,null,null,null,null,null,null,null,{"$f":"DA5","v":0.01}]
["Delay(ns/m)",6.5,null,null,null,{"$f":"F4+$C$4","v":1.95},{"$f":"$B$9*G29","v":-0.87861035936689647},null,{"$f":"I4+1","v":1},{"$f":"SMALL(F$4:F$50,I5)","v":0},{"$f":"IF($J5<K$2,0,IF($J5-K$2>$B$7,K$3,($J5-K$2)/$B$7*K$3))","v":0},0,0,0,0,0,0,0,0,0,0,0,{"$f":"SUM(K5:V5)","v":0},null,{"$f":"IF($J5<Y$2,0,IF($J5-Y$2>$B$7,Y$3,($J5-Y$2)/$B$7*Y$3))","v":0},0,0,0,0,0,0,0,0,0,0,{"$f":"SUM(Y5:AI5)","v":0},{"$f":"W5+AJ5+$B$15","v":0.01},null,null,{"$f":"AN4+$C$4","v":2.9249999999999998},{"$f":"$B$9*AO29","v":-0.87861035936689647},null,{"$f":"AQ3+1","v":1},{"$f":"SMALL(AN$4:AN$50,AQ5)","v":0.97499999999999998},{"$f":"IF($AR5<AS$2,0,IF($AR5-AS$2>$B$7,AS$3,($AR5-AS$2)/$B$7*AS$3))","v":0},0,0,0,0,0,0,0,0,0,0,0,{"$f":"SUM(AS5:BD5)","v":0},null,{"$f":"IF($AR5<BG$2,0,IF($AR5-BG$2>$B$7,BG$3,($AR5-BG$2)/$B$7*BG$3))","v":0},0,0,0,0,0,0,0,0,0,0,{"$f":"SUM(BG5:BQ5)","v":0},{"$f":"BE5+BR5+$B$15","v":0.01},null,null,{"$f":"BV4+$C$4","v":2.9249999999999998},{"$f":"$B$9*BW29","v":-0.87861035936689647},null,{"$f":"BY3+1","v":1},{"$f":"SMALL(BV$4:BV$50,BY5)","v":0.97499999999999998},{"$f":"IF($BZ5<CA$2,0,IF($BZ5-CA$2>$B$7,CA$3,($BZ5-CA$2)/$B$7*CA$3))","v":0},0,0,0,0,0,0,0,0,0,0,0,{"$f":"SUM(CA5:CL5)","v":0},null,{"$f":"IF($BZ5<CO$2,0,IF($BZ5-CO$2>$B$7,CO$3,($BZ5-CO$2)/$B$7*CO$3))","v":0},0,0,0,0,0,0,0,0,0,0,{"$f":"SUM(CO5:CY5)","v":0},{"$f":"CM5+CZ5+$B$15","v":0.01}]
["Length(m)",{"$f":"VLOOKUP(波形!P12,Data!N2:O9,2,0)*0.01","v":0.15},null,null,null,3.9,0.33789327026153881,null,2,{"$f":"SMALL(F$4:F$50,I6)","v":0.5},2.2846153845837516,0,0,0,0,0,0,0,0,0,0,0,2.2846153845837516,null,0,0,0,0,0,0,0,0,0,0,0,0,{"$f":"W6+AJ6+$B$15","v":2.2946153845837514},null,null,4.875,0.33789327026153881,null,{"$f":"AQ5+1","v":2},{"$f":"SMALL(AN$4:AN$50,AQ6)","v":0.97499999999999998},0,0,0,0,0,0,0,0,0,0,0,0,0,null,0,0,0,0,0,0,0,0,0,0,0,0,{"$f":"BE6+BR6+$B$15","v":0.01},null,null,4.875,0.33789327026153881,null,{"$f":"BY5+1","v":2},{"$f":"SMALL(BV$4:BV$50,BY6)","v":0.97499999999999998},0,0,0,0,0,0,0,0,0,0,0,0,0,null,0,0,0,0,0,0,0,0,0,0,0,0,{"$f":"CM6+CZ6+$B$15","v":0.01}]
["tr(ns)",{"$f":"VLOOKUP(波形!E8,Data!K2:L8,2,0)","v":0.5},null,null,null,5.85,-0.12994595484886676,null,3,1.95,2.2846153845837516,0,0,0,0,0,0,0,0,0,0,0,2.2846153845837516,null,0,0,0,0,0,0,0,0,0,0,0,0,2.2946153845837514,null,null,6.8250000000000002,-0.12994595484886676,null,3,1.4750000000000001,2.284615384583752,0,0,0,0,0,0,0,0,0,0,0,2.284615384583752,null,2.2843869344677992,0,0,0,0,0,0,0,0,0,0,2.2843869344677992,4.5790023190515505,null,null,6.8250000000000002,-0.12994595484886676,null,3,1.4750000000000001,2.284615384583752,0,0,0,0,0,0,0,0,0,0,0,2.284615384583752,null,2.2843869344677992,0,0,0,0,0,0,0,0,0,0,2.2843869344677992,4.5790023190515505]
[null,null,null,null,null,7.8,4.99742157294625E-2,null,4,1.95,2.2846153845837516,0,0,0,0,0,0,0,0,0,0,0,2.2846153845837516,null,0,0,0,0,0,0,0,0,0,0,0,0,2.2946153845837514,null,null,8.7750000000000004,4.99742157294625E-2,null,4,1.4750000000000001,2.284615384583752,0,0,0,0,0,0,0,0,0,0,0,2.284615384583752,null,2.2843869344677992,0,0,0,0,0,0,0,0,0,0,2.2843869344677992,4.5790023190515505,null,null,8.7750000000000004,4.99742157294625E-2,null,4,1.4750000000000001,2.284615384583752,0,0,0,0,0,0,0,0,0,0,0,2.284615384583752,null,2.2843869344677992,0,0,0,0,0,0,0,0,0,0,2.2843869344677992,4.5790023190515505]
["r1",{"$f":"(B1-$B$3)/(B1+$B$3)","v":-0.38461538459621303},null,null,null,9.75,-1.9218930213560526E-2,null,5,2.4500000000000002,2.2846153845837516,-0.87861035936689691,0,0,0,0,0,0,0,0,0,0,1.4060050252168548,null,2.2843869344677996,0,0,0,0,0,0,0,0,0,0,2.2843869344677996,3.7003919596846542,null,null,10.725,-1.9218930213560526E-2,null,5,2.9249999999999998,2.2846153845837516,0,0,0,0,0,0,0,0,0,0,0,2.2846153845837516,null,2.2843869344677987,0,0,0,0,0,0,0,0,0,0,2.2843869344677987,4.5790023190515505,null,null,10.725,-1.9218930213560526E-2,null,5,2.9249999999999998,2.2846153845837516,0,0,0,0,0,0,0,0,0,0,0,2.2846153845837516,null,2.2843869344677987,0,0,0,0,0,0,0,0,0,0,2.2843869344677987,4.5790023190515505]
["r2",{"$f":"(B2-$B$3)/(B2+$B$3)","v":0.99990000499974996},null,null,null,11.7,7.3911570829504319E-3,null,6,2.4500000000000002,2.2846153845837516,-0.87861035936689691,0,0,0,0,0,0,0,0,0,0,1.4060050252168548,null,2.2843869344677996,0,0,0,0,0,0,0,0,0,0,2.2843869344677996,3.7003919596846542,null,null,12.674999999999999,7.3911570829504319E-3,null,6,2.9249999999999998,2.2846153845837516,0,0,0,0,0,0,0,0,0,0,0,2.2846153845837516,null,2.2843869344677987,0,0,0,0,0,0,0,0,0,0,2.2843869344677987,4.5790023190515505,null,null,12.674999999999999,7.3911570829504319E-3,null,6,2.9249999999999998,2.2846153845837516,0,0,0,0,0,0,0,0,0,0,0,2.2846153845837516,null,2.2843869344677987,0,0,0,0,0,0,0,0,0,0,2.2843869344677987,4.5790023190515505]
[null,null,null,null,null,13.649999999999999,-2.8424684630106501E-3,null,7,3.9,2.2846153845837516,-0.87861035936689647,0,0,0,0,0,0,0,0,0,0,1.4060050252168552,null,2.2843869344677987,0,0,0,0,0,0,0,0,0,0,2.2843869344677987,3.7003919596846537,null,null,14.624999999999998,-2.8424684630106501E-3,null,7,3.4249999999999998,2.2846153845837516,-0.87861035936689647,0,0,0,0,0,0,0,0,0,0,1.4060050252168552,null,2.2843869344677987,-0.87852250272379184,0,0,0,0,0,0,0,0,0,1.405864431744007,2.821869456960862,null,null,14.624999999999998,-2.8424684630106501E-3,null,7,3.4249999999999998,2.2846153845837516,-0.87861035936689647,0,0,0,0,0,0,0,0,0,0,1.4060050252168552,null,2.2843869344677987,-0.87852250272379184,0,0,0,0,0,0,0,0,0,1.405864431744007,2.821869456960862]
["電圧(V)",{"$f":"VLOOKUP(波形!D5,Data!Q2:R8,2,0)","v":3.3},null,null,null,15.599999999999998,1.0931477808593494E-3,null,8,3.9,2.2846153845837516,-0.87861035936689647,0,0,0,0,0,0,0,0,0,0,1.4060050252168552,null,2.2843869344677987,0,0,0,0,0,0,0,0,0,0,2.2843869344677987,3.7003919596846537,null,null,16.574999999999999,1.0931477808593494E-3,null,8,3.4249999999999998,2.2846153845837516,-0.87861035936689647,0,0,0,0,0,0,0,0,0,0,1.4060050252168552,null,2.2843869344677987,-0.87852250272379184,0,0,0,0,0,0,0,0,0,1.405864431744007,2.821869456960862,null,null,16.574999999999999,1.0931477808593494E-3,null,8,3.4249999999999998,2.2846153845837516,-0.87861035936689647,0,0,0,0,0,0,0,0,0,0,1.4060050252168552,null,2.2843869344677987,-0.87852250272379184,0,0,0,0,0,0,0,0,0,1.405864431744007,2.821869456960862]
["中間点",{"$f":"VLOOKUP(波形!O6,Data!Z2:AA7,2,0)","v":1},null,null,null,17.549999999999997,-4.2039941211240205E-4,null,9,4.4000000000000004,2.2846153845837516,-0.87861035936689647,0.33789327026153909,0,0,0,0,0,0,0,0,0,1.7438982954783944,null,2.2843869344677987,-0.87852250272379262,0,0,0,0,0,0,0,0,0,1.4058644317440061,3.1597627272224003,null,null,18.524999999999999,-4.2039941211240205E-4,null,9,4.875,2.2846153845837516,-0.87861035936689647,0,0,0,0,0,0,0,0,0,0,1.4060050252168552,null,2.2843869344677987,-0.87852250272379184,0,0,0,0,0,0,0,0,0,1.405864431744007,2.821869456960862,null,null,18.524999999999999,-4.2039941211240205E-4,null,9,4.875,2.2846153845837516,-0.87861035936689647,0,0,0,0,0,0,0,0,0,0,1.4060050252168552,null,2.2843869344677987,-0.87852250272379184,0,0,0,0,0,0,0,0,0,1.405864431744007,2.821869456960862]
["VT",{"$f":"VLOOKUP(波形!V3,Data!W2:X7,2,0)","v":0},null,null,null,19.499999999999996,1.6167591317389597E-4,null,10,4.4000000000000004,2.2846153845837516,-0.87861035936689647,0.33789327026153909,0,0,0,0,0,0,0,0,0,1.7438982954783944,null,2.2843869344677987,-0.87852250272379262,0,0,0,0,0,0,0,0,0,1.4058644317440061,3.1597627272224003,null,null,20.474999999999998,1.6167591317389597E-4,null,10,4.875,2.2846153845837516,-0.87861035936689647,0,0,0,0,0,0,0,0,0,0,1.4060050252168552,null,2.2843869344677987,-0.87852250272379184,0,0,0,0,0,0,0,0,0,1.405864431744007,2.821869456960862,null,null,20.474999999999998,1.6167591317389597E-4,null,10,4.875,2.2846153845837516,-0.87861035936689647,0,0,0,0,0,0,0,0,0,0,1.4060050252168552,null,2.2843869344677987,-0.87852250272379184,0,0,0,0,0,0,0,0,0,1.405864431744007,2.821869456960862]
["Lo分圧",{"$f":"IF(B14*B1/(B1+B2)<0.01,0.01,B14*B1/(B1+B2))","v":0.01},null,null,null,21.449999999999996,-6.2176825531869083E-5,null,11,5.85,{"$f":"IF($J15<K$2,0,IF($J15-K$2>$B$7,K$3,($J15-K$2)/$B$7*K$3))","v":2.2846153845837516},-0.87861035936689647,0.33789327026153881,0,0,0,0,0,0,0,0,0,1.7438982954783939,null,{"$f":"IF($J15<Y$2,0,IF($J15-Y$2>$B$7,Y$3,($J15-Y$2)/$B$7*Y$3))","v":2.2843869344677987},-0.87852250272379184,0,0,0,0,0,0,0,0,0,1.405864431744007,3.1597627272224007,null,null,22.424999999999997,-6.2176825531869083E-5,null,11,5.375,{"$f":"IF($AR15<AS$2,0,IF($AR15-AS$2>$B$7,AS$3,($AR15-AS$2)/$B$7*AS$3))","v":2.2846153845837516},-0.87861035936689647,0.33789327026153881,0,0,0,0,0,0,0,0,0,1.7438982954783939,null,{"$f":"IF($AR15<BG$2,0,IF($AR15-BG$2>$B$7,BG$3,($AR15-BG$2)/$B$7*BG$3))","v":2.2843869344677987},-0.87852250272379184,0.33785948262389454,0,0,0,0,0,0,0,0,1.7437239143679015,3.4976222098462952,null,null,22.424999999999997,-6.2176825531869083E-5,null,11,5.375,{"$f":"IF($BZ15<CA$2,0,IF($BZ15-CA$2>$B$7,CA$3,($BZ15-CA$2)/$B$7*CA$3))","v":2.2846153845837516},-0.87861035936689647,0.33789327026153881,0,0,0,0,0,0,0,0,0,1.7438982954783939,null,{"$f":"IF($BZ15<CO$2,0,IF($BZ15-CO$2>$B$7,CO$3,($BZ15-CO$2)/$B$7*CO$3))","v":2.2843869344677987},-0.87852250272379184,0.33785948262389454,0,0,0,0,0,0,0,0,1.7437239143679015,3.4976222098462952]
{"$rows_left_out":35}